centos7安装oracle11g报错,请问怎么解?

在centos7下安装oracle11g到85%时报错提示Error in invoking target 'install' of makefile ins_ctxm.mk查了log

提示如下

INFO: Start output from spawned process:

INFO: ----------------------------------

INFO:

INFO: gcc -o ctxload -m64 -L/data/oracle/product/11.2.0/db_1/ctx/lib/ -L/data/oracle/product/11.2.0/db_1/lib/ -L/data/oracle/product/11.2.0/db_1/lib/stubs/  /data/oracle/product/11.2.0/db_1/ctx/lib/sdrz.o -lctxs11 -lctx11 -lctxs11 -lzx11 -lgx11 -lctx11 -lzx11 -lgx11  -lclntsh  `cat /data/oracle/product/11.2.0/db_1/lib/ldflags`    -lncrypt11 -lnsgr11 -lnzjs11 -ln11 -lnl11 -lnro11 `cat /data/oracle/product/11.2.0/db_1/lib/ldflags`    -lncrypt11 -lnsgr11 -lnzjs11 -ln11 -lnl11 -lnnz11 -lzt11 -lztkg11 -lztkg11 -lclien

INFO: t11 -lnnetd11  -lvsn11 -lcommon11 -lgeneric11 -lmm -lsnls11 -lnls11  -lcore11 -lsnls11 -lnls11 -lcore11 -lsnls11 -lnls11 -lxml11 -lcore11 -lunls11 -lsnls11 -lnls11 -lcore11 -lnls11 `cat /data/oracle/product/11.2.0/db_1/lib/ldflags`    -lncrypt11 -lnsgr11 -lnzjs11 -ln11 -lnl11 -lnro11 `cat /data/oracle/product/11.2.0/db_1/lib/ldflags`    -lncrypt11 -lnsgr11 -lnzjs11 -ln11 -lnl11 -lclient11 -lnnetd11  -lvsn11 -lcommon11 -lgeneric11   -lsnls11 -lnls11  -lcore11 -lsnls11 -lnls11 -lcore11 -lsnls11 -lnls11 -lxml1

INFO: 1 -lcore11 -lunls11 -lsnls11 -lnls11 -lcore11 -lnls11 -lclient11 -lnnetd11  -lvsn11 -lcommon11 -lgeneric11 -lsnls11 -lnls11  -lcore11 -lsnls11 -lnls11 -lcore11 -lsnls11 -lnls11 -lxml11 -lcore11 -lunls11 -lsnls11 -lnls11 -lcore11 -lnls11   `cat /data/oracle/product/11.2.0/db_1/lib/sysliblist` -Wl,-rpath,/data/oracle/product/11.2.0/db_1/lib -lm    `cat /data/oracle/product/11.2.0/db_1/lib/sysliblist` -ldl -lm   -L/data/oracle/product/11.2.0/db_1/lib

INFO: mv -f /data/oracle/product/11.2.0/db_1/bin/ctxload /data/oracle/product/11.2.0/db_1/bin/ctxloadO

INFO: mv ctxload /data/oracle/product/11.2.0/db_1/bin/ctxload

INFO: chmod 751 /data/oracle/product/11.2.0/db_1/bin/ctxload

INFO: gcc -o ctxlc -m64 -L/data/oracle/product/11.2.0/db_1/ctx/lib/ -L/data/oracle/product/11.2.0/db_1/lib/ -L/data/oracle/product/11.2.0/db_1/lib/stubs/  /data/oracle/product/11.2.0/db_1/ctx/lib/sdrllc.o -lctxs11 -lctx11 -lctxs11 -lzx11 -lgx11 -lctx11 -lzx11 -lgx11  -lclntsh  `cat /data/oracle/product/11.2.0/db_1/lib/ldflags`    -lncrypt11 -lnsgr11 -lnzjs11 -ln11 -lnl11 -lnro11 `cat /data/oracle/product/11.2.0/db_1/lib/ldflags`    -lncrypt11 -lnsgr11 -lnzjs11 -ln11 -lnl11 -lnnz11 -lzt11 -lztkg11 -lztkg11 -lclien

INFO: t11 -lnnetd11  -lvsn11 -lcommon11 -lgeneric11 -lmm -lsnls11 -lnls11  -lcore11 -lsnls11 -lnls11 -lcore11 -lsnls11 -lnls11 -lxml11 -lcore11 -lunls11 -lsnls11 -lnls11 -lcore11 -lnls11 `cat /data/oracle/product/11.2.0/db_1/lib/ldflags`    -lncrypt11 -lnsgr11 -lnzjs11 -ln11 -lnl11 -lnro11 `cat /data/oracle/product/11.2.0/db_1/lib/ldflags`    -lncrypt11 -lnsgr11 -lnzjs11 -ln11 -lnl11 -lclient11 -lnnetd11  -lvsn11 -lcommon11 -lgeneric11   -lsnls11 -lnls11  -lcore11 -lsnls11 -lnls11 -lcore11 -lsnls11 -lnls11 -lxml1

INFO: 1 -lcore11 -lunls11 -lsnls11 -lnls11 -lcore11 -lnls11 -lclient11 -lnnetd11  -lvsn11 -lcommon11 -lgeneric11 -lsnls11 -lnls11  -lcore11 -lsnls11 -lnls11 -lcore11 -lsnls11 -lnls11 -lxml11 -lcore11 -lunls11 -lsnls11 -lnls11 -lcore11 -lnls11   `cat /data/oracle/product/11.2.0/db_1/lib/sysliblist` -Wl,-rpath,/data/oracle/product/11.2.0/db_1/lib -lm    `cat /data/oracle/product/11.2.0/db_1/lib/sysliblist` -ldl -lm   -L/data/oracle/product/11.2.0/db_1/lib

INFO: mv -f /data/oracle/product/11.2.0/db_1/bin/ctxlc /data/oracle/product/11.2.0/db_1/bin/ctxlcO

INFO: mv ctxlc /data/oracle/product/11.2.0/db_1/bin/ctxlc

INFO: chmod 751 /data/oracle/product/11.2.0/db_1/bin/ctxlc

INFO: gcc -o ctxhx -m64 -L/data/oracle/product/11.2.0/db_1/ctx/lib/ -L/data/oracle/product/11.2.0/db_1/lib/ -L/data/oracle/product/11.2.0/db_1/lib/stubs/  /data/oracle/product/11.2.0/db_1/ctx/lib/ctxhx.o -L/data/oracle/product/11.2.0/db_1/ctx/lib/ -lm -lsc_fa -lsc_ex -lsc_da -lsc_ca -lz  -lctxhx -Wl,-rpath,/data/oracle/product/11.2.0/db_1/ctx/lib -lsnls11 -lnls11  -lcore11 -lsnls11 -lnls11 -lcore11 -lsnls11 -lnls11 -lxml11 -lcore11 -lunls11 -lsnls11 -lnls11 -lcore11 -lnls11  `cat /data/oracle/product/11.2.0/db_1/

INFO: lib/sysliblist`

INFO: /lib64/libstdc++.so.5: undefined reference to `[email]memcpy@GLIBC_2.14[/email]'

INFO: collect2: error: ld returned 1 exit status

INFO: make: *** [ctxhx] Error 1

INFO: End output from spawned process.

INFO: ----------------------------------

INFO: Exception thrown from action: make

Exception Name: MakefileException

Exception String: Error in invoking target 'install' of makefile '/data/oracle/product/11.2.0/db_1/ctx/lib/ins_ctx.mk'. See '/data/oraInventory/logs/installActions2015-02-27_12-12-50PM.log' for details.

本机已经安装glibc

glibc-devel-2.17-55.el7_0.5-(x86_64)

glibc-utils-2.17-55.el7_0.5-(x86_64)

glibc-static-2.17-55.el7_0.5-(x86_64)

glibc-common-2.17-55.el7_0.5-(x86_64)

glibc-2.17-55.el7_0.5-(x86_64)

glibc-2.17-55.el7-(i686)

glibc-headers-2.17-55.el7_0.5-(x86_64)

linux oracle swd.oui,centos7安装oracle11g报错,请问怎么解?相关推荐

  1. centos7安装oracle11g报错,centos7安装oracle11gR2

    上传安装包 linux.x64_11gR2_database_1of2.zip linux.x64_11gR2_database_2of2.zip 创建运行oracle数据库的系统用户和用户组 [jo ...

  2. CentOS7安装twisted报错: src/twisted/test/raiser.c:4:20: fatal error: Python.h : No such file or direc

    问题: CentOS7安装twisted报错: src/twisted/test/raiser.c:4:20: fatal error: Python.h : No such file or dire ...

  3. 【Linux】centos7安装bcp报错

    安装bcp报错如下: Error: Protected multilib versions: unixODBC-devel-2.3.7-1.rh.x86_64 != unixODBC-devel-2. ...

  4. 【Linux】centos7安装mysql报错:error: Failed dependencies: MySQL-client < 5.7.38-1.el7 is obsoleted by mys

    报错 原因 根据报错提示显示是msql-clinet被弃用,百度之后发现好多是"is needed"缺少相关依赖包,需要安包,而我这个是被弃用,然后继续百度意外发现,只需要命令后加 ...

  5. centos7安装uwsgi报错_如何将CentOS 7升级到CentOS 8

    在本文中,您将学习如何将CentOS 7升级到CentOS 8.本文描述的步骤尚未描述正式升级,因此不能应用于生产服务器. ​ Upgrade-CentOS-7-to-CentOS-8 步骤1:安装E ...

  6. python mysqldb安装_解决centos7 安装MySQLdb-python 报错 方案

    运行 pip install MySQL-Python 报错: 云服务器 Command python setup.py egg_info failed with error code 1 in 继续 ...

  7. centos7 安装docker 报错 conflicts with file from package

    对于docker重装的情况,会比较容易出现如下问题: 1.因为之前已经安装过旧版本的docker,在安装的时候报错如下: Transaction check error:file /usr/bin/d ...

  8. centos7安装gcc报错

    yum install -y gcc报错的解决方法如下 错误:软件包:glibc-2.17-196.el7.i686 (yum.repo) 需要:glibc-common = 2.17-196.el7 ...

  9. aix 6安装oracle 11g,求助!AIX6.1安装Oracle11g报错

    有tracce文件一份. [main] [5:23:24:664] [CommandLineArguments.process:639]  CommandLineArguments->proce ...

最新文章

  1. python语言if语句-python的if语句
  2. 版权之争,谁更棋高一着?
  3. ArcGIS 10.6字段计算器(Field Calculator)字段任意填充编码序列(奇数、偶数序列、自定义间隔)
  4. LeetCode 375. 猜数字大小 II(DP)
  5. 计算机工程学院迎新晚会,计算机与信息工程学院2016级迎新晚会举行
  6. 2021水电消纳交易电量增长超150% 价格已提高16%
  7. 转 海量数据处理(2)
  8. 如何将妙控键盘连接到 Macbook?
  9. 190819每日一句
  10. 书评 微权力下的成功项目管控(第2版)
  11. Maya动画2:刚体+重力模拟小球掉落
  12. Emoji表情的的文字编码问题
  13. (4)ArcGIS 10.2 去除要素的Z值和M值
  14. matlab画指定角度圆弧,CAD中如何根据指定的角度画圆弧
  15. MAC地址IP地址 端口
  16. 从源码角度浅谈IRP
  17. ramdisk.img
  18. 京东口罩到货,邮件实时通知
  19. 中华英才网裁员,五成员工可拿(N+3)*月薪的离职补偿
  20. iphone 后台循环播放音乐

热门文章

  1. linux unix域socket_Socket通信原理
  2. 罗德里格斯(Rodrigues)旋转向量与矩阵的变换
  3. 计算机操作员实操高级试题,计算机操作员高级实操(以往考过,可做平时练习素材)答题.doc...
  4. Python应用实战-Pandas 计算连续行为天数的几种思路
  5. san框架计数的textarea
  6. java安全权限_java.security.SecurityPermission
  7. 怎么邀请人加入组队_糖豆人:终极淘汰赛怎么玩?玩法技巧介绍
  8. 报名照片审核处理工具_太浦军考|2020年文职人员报名照片审核程序,照片处理工具应该如何使用?...
  9. 【APICloud系列|25】 easeChat模块(环信-即时通讯)的实现
  10. 太原师范学院计算机二级报名,山西计算机等级考试报名地点